Target
Bromodomain-containing protein 4 [42-168]
Ligand
BDBM318484
Substrate
Meas. Tech.
AlphaScreen Assay A1
IC50
<100±n/a nM
Citation
 Combs, APSparks, RBMaduskuie, Jr., TPRodgers, JD Tricyclic heterocycles as BET protein inhibitors US Patent  US10464947 Publication Date 11/5/2019 
Target
Name:
Bromodomain-containing protein 4 [42-168]
Synonyms:
BRD4 BRD4_HUMAN HUNK1
Type:
Enzyme Catalytic Domain
Mol. Mass.:
15054.68
Organism:
Homo sapiens (Human)
Description:
O60885[42-168]
Residue:
127
  
Inhibitor
Name:
BDBM318484
Synonyms:
2-{[7-(3,5-Dimethylisoxazol-4-yl)-4-phenyl-4,5-dihydroimidazo[1,5,4-de][1,4]benzoxazin-2-yl]amino}propan-1-ol US9624241, Example 30
Type:
Small organic molecule
Emp. Form.:
C23H24N4O3
Mol. Mass.:
404.4617
SMILES:
CC(CO)Nc1nc2ccc(-c3c(C)noc3C)c3OC[C@H](c4ccccc4)n1c23
: