Target
Bromodomain-containing protein 4 [42-168]
Ligand
BDBM318496
Substrate
Meas. Tech.
AlphaScreen Assay A1
IC50
<100±n/a nM
Citation
 Combs, APSparks, RBMaduskuie, Jr., TPRodgers, JD Tricyclic heterocycles as BET protein inhibitors US Patent  US10464947 Publication Date 11/5/2019 
Target
Name:
Bromodomain-containing protein 4 [42-168]
Synonyms:
BRD4 BRD4_HUMAN HUNK1
Type:
Enzyme Catalytic Domain
Mol. Mass.:
15054.68
Organism:
Homo sapiens (Human)
Description:
O60885[42-168]
Residue:
127
  
Inhibitor
Name:
BDBM318496
Synonyms:
2-{2-[7-(3,5-Dimethylisoxazol- 4-yl)-2-oxo-1,2,4,5- tetrahydroimidazo[1,5,4- de][1,4]benzoxazin-4- yl]phenoxy}-N-(2- hydroxyethyl)acetamide US11498926, Example 50 | US9624241, Example 50
Type:
Small organic molecule
Emp. Form.:
C24H24N4O6
Mol. Mass.:
464.4706
SMILES:
Cc1noc(C)c1-c1ccc2[nH]c(=O)n3C(COc1c23)c1ccccc1OCC(=O)NCCO
: