Target
Bromodomain-containing protein 4 [42-168]
Ligand
BDBM318497
Substrate
Meas. Tech.
AlphaScreen Assay A1
IC50
<100±n/a nM
Citation
 Combs, APSparks, RBMaduskuie, Jr., TPRodgers, JD Tricyclic heterocycles as BET protein inhibitors US Patent  US10464947 Publication Date 11/5/2019 
Target
Name:
Bromodomain-containing protein 4 [42-168]
Synonyms:
BRD4 BRD4_HUMAN HUNK1
Type:
Enzyme Catalytic Domain
Mol. Mass.:
15054.68
Organism:
Homo sapiens (Human)
Description:
O60885[42-168]
Residue:
127
  
Inhibitor
Name:
BDBM318497
Synonyms:
2-{2-[7-(3,5-Dimethylisoxazol- 4-yl)-2-oxo-1,2,4,5- tetrahydroimidazo[1,5,4- de][1,4]benzoxazin-4- yl]phenoxy}-N,N- dimethylacetamide US11498926, Example 51 | US9624241, Example 51
Type:
Small organic molecule
Emp. Form.:
C24H24N4O5
Mol. Mass.:
448.4712
SMILES:
CN(C)C(=O)COc1ccccc1C1COc2c(ccc3[nH]c(=O)n1c23)-c1c(C)noc1C
: