Target
Bromodomain-containing protein 4 [42-168]
Ligand
BDBM318511
Substrate
Meas. Tech.
AlphaScreen Assay A2
IC50
<100±n/a nM
Citation
 Combs, APSparks, RBMaduskuie, Jr., TPRodgers, JD Tricyclic heterocycles as BET protein inhibitors US Patent  US10464947 Publication Date 11/5/2019 
Target
Name:
Bromodomain-containing protein 4 [42-168]
Synonyms:
BRD4 BRD4_HUMAN HUNK1
Type:
Enzyme Catalytic Domain
Mol. Mass.:
15054.68
Organism:
Homo sapiens (Human)
Description:
O60885[42-168]
Residue:
127
  
Inhibitor
Name:
BDBM318511
Synonyms:
7-(3,5-Dimethylisoxazol-4-yl)-4,9-diphenyl-4,5-dihydroimidazo[1,5,4-de][1,4]benzoxazin-2(1H)-one US11498926, Example 43 | US9624241, Example 43
Type:
Small organic molecule
Emp. Form.:
C26H21N3O3
Mol. Mass.:
423.4632
SMILES:
Cc1noc(C)c1-c1cc(-c2ccccc2)c2[nH]c(=O)n3C(COc1c23)c1ccccc1
: