Target
Bromodomain-containing protein 4 [42-168]
Ligand
BDBM318524
Substrate
Meas. Tech.
AlphaScreen Assay A2
IC50
<100±n/a nM
Citation
 Combs, APSparks, RBMaduskuie, Jr., TPRodgers, JD Tricyclic heterocycles as BET protein inhibitors US Patent  US10464947 Publication Date 11/5/2019 
Target
Name:
Bromodomain-containing protein 4 [42-168]
Synonyms:
BRD4 BRD4_HUMAN HUNK1
Type:
Enzyme Catalytic Domain
Mol. Mass.:
15054.68
Organism:
Homo sapiens (Human)
Description:
O60885[42-168]
Residue:
127
  
Inhibitor
Name:
BDBM318524
Synonyms:
7-(3,5-Dimethylisoxazol-4-yl)-4-ethyl-4-pyridin-2-yl-4,5-dihydroimidazo[1,5,4-de][1,4]benzoxazin-2(1H)-one 2,2,2-trifluoroacetate US11498926, Example 70 | US9624241, Example 70
Type:
Small organic molecule
Emp. Form.:
C21H20N4O3
Mol. Mass.:
376.4085
SMILES:
CCC1(COc2c(ccc3[nH]c(=O)n1c23)-c1c(C)noc1C)c1ccccn1
: