Target
Bromodomain-containing protein 4 [42-168]
Ligand
BDBM318537
Substrate
Meas. Tech.
AlphaScreen Assay A2
IC50
<100±n/a nM
Citation
 Combs, APSparks, RBMaduskuie, Jr., TPRodgers, JD Tricyclic heterocycles as BET protein inhibitors US Patent  US10464947 Publication Date 11/5/2019 
Target
Name:
Bromodomain-containing protein 4 [42-168]
Synonyms:
BRD4 BRD4_HUMAN HUNK1
Type:
Enzyme Catalytic Domain
Mol. Mass.:
15054.68
Organism:
Homo sapiens (Human)
Description:
O60885[42-168]
Residue:
127
  
Inhibitor
Name:
BDBM318537
Synonyms:
US10464947, Example 83 US9624241, Example 83 | tert-butyl 4-[(4S)-7-(3,5- dimethylisoxazol-4-yl)-2-oxo- 4-pyridin-2-yl-1,2,4,5- tetrahydroimidazo[1,5,4- de][1,4]benzoxazin-9-yl]-3,6- dihydropyridine-1(2H)- carboxylate 2,2,2- trifluoroacetate
Type:
Small organic molecule
Emp. Form.:
C29H31N5O5
Mol. Mass.:
529.5869
SMILES:
Cc1noc(C)c1-c1cc(C2=CCN(CC2)C(=O)OC(C)(C)C)c2[nH]c(=O)n3[C@H](COc1c23)c1ccccn1
: