Target
Bromodomain-containing protein 4 [42-168]
Ligand
BDBM318542
Substrate
Meas. Tech.
AlphaScreen Assay A2
IC50
<100±n/a nM
Citation
 Combs, APSparks, RBMaduskuie, Jr., TPRodgers, JD Tricyclic heterocycles as BET protein inhibitors US Patent  US10464947 Publication Date 11/5/2019 
Target
Name:
Bromodomain-containing protein 4 [42-168]
Synonyms:
BRD4 BRD4_HUMAN HUNK1
Type:
Enzyme Catalytic Domain
Mol. Mass.:
15054.68
Organism:
Homo sapiens (Human)
Description:
O60885[42-168]
Residue:
127
  
Inhibitor
Name:
BDBM318542
Synonyms:
(4S)-7-(3,5-Dimethylisoxazol-4-yl)-4-pyridin-2-yl-2-vinyl-4,5-dihydroimidazo[1,5,4-de][1,4]benzoxazine US11498926, Example 88 | US9624241, Example 88
Type:
Small organic molecule
Emp. Form.:
C21H18N4O2
Mol. Mass.:
358.3932
SMILES:
Cc1noc(C)c1-c1ccc2nc(C=C)n3[C@H](COc1c23)c1ccccn1
: