Target
P2X purinoceptor 2/3
Ligand
BDBM320073
Substrate
Meas. Tech.
Biological Assay
IC50
35.0±n/a nM
Citation
 Davenport, AJBräuer, NFischer, OMRotgeri, ARottmann, ANeagoe, INagel, JGodinho-Coelho, AKlar, J 1,3-thiazol-2-yl substituted benzamides US Patent  US10472354 Publication Date 11/12/2019 
Target
Name:
P2X purinoceptor 2/3
Synonyms:
P2X2/3 | P2X2/P2X3 heterotrimeric receptor
Type:
Protein
Mol. Mass.:
Description:
Components:
This complex has 2 components.
Component 1
Name:
P2X purinoceptor 2
Synonyms:
ATP receptor P2RX2_HUMAN Purinergic receptor | PurinergicP2X2/3
Type:
Enzyme Catalytic Domain
Mol. Mass.:
51765.18
Organism:
Homo sapiens (Human)
Description:
PurinergicP2X2/3 0 HUMAN::Q9UBL9
Residue:
471
  
Component 2
Name:
P2X purinoceptor 3
Synonyms:
ATP receptor P2RX3 P2X purinoceptor 3 P2X purinoceptor 3 (P2X3) P2X3 purinoceptor p2x3 + hsa
Type:
Protein
Mol. Mass.:
44292.02
Organism:
Homo sapiens (Human)
Description:
P56373
Residue:
397
  
Inhibitor
Name:
BDBM320073
Synonyms:
3-(5-ethyl-1,3- thiazol-2-yl)-N- [(1R)-1-(6- methylpyridazin-3- yl)ethyl]-5-[(3R)- tetrahydrofuran-3- yloxy]benzamide US10202369, Example 249 | US10472354, Example 240
Type:
Small organic molecule
Emp. Form.:
C23H26N4O3S
Mol. Mass.:
438.543
SMILES:
CCc1cnc(s1)-c1cc(O[C@@H]2CCOC2)cc(c1)C(=O)N[C@H](C)c1ccc(C)nn1
: