Target
Mitogen-activated protein kinase kinase kinase 11
Ligand
BDBM354745
Substrate
Meas. Tech.
Radiometric Filter Plate MLK3 Assay
IC50
>1000±n/a nM
Citation
 Gelbard, HADewhurst, SGendelman, HE Mixed lineage kinase inhibitors for HIV/AIDS therapies US Patent  US10485800 Publication Date 11/26/2019 
Target
Name:
Mitogen-activated protein kinase kinase kinase 11
Synonyms:
M3K11_HUMAN MLK3 Mixed Lineage Kinase 3 (MLK3) SPRK
Type:
PROTEIN
Mol. Mass.:
92696.93
Organism:
Homo sapiens (Human)
Description:
ChEMBL_1460565
Residue:
847
  
Inhibitor
Name:
BDBM354745
Synonyms:
Preparation of 5-(3-(3-chloro-4-fluorophenyl)-1H-pyrrolo[2,3-b]pyridin-5-yl)-N,N-dimethylpyridin-2-amine US9814704, Example 22
Type:
Small organic molecule
Emp. Form.:
C20H16ClFN4
Mol. Mass.:
366.819
SMILES:
CN(C)c1ccc(cn1)-c1cnc2[nH]cc(-c3ccc(F)c(Cl)c3)c2c1
: