Target
Voltage-dependent T-type calcium channel subunit alpha-1G
Ligand
BDBM164210
Substrate
Meas. Tech.
High-Throughput Cav3.1 T-Type Fluorescent Assay
IC50
>10000±n/a nM
Citation
 PubChem, PCPajouhesh, HHolland, RZhang, LPajouhesh, HLamontagne, JWhelan, B Benzimidazole inhibitors of the sodium channel US Patent  US9688615 Publication Date 6/27/2017 
Target
Name:
Voltage-dependent T-type calcium channel subunit alpha-1G
Synonyms:
CAC1G_HUMAN KIAA1123 Voltage-gated T-type calcium channel alpha-1G subunit
Type:
PROTEIN
Mol. Mass.:
262471.14
Organism:
Homo sapiens (Human)
Description:
ChEMBL_1515216
Residue:
2377
  
Inhibitor
Name:
BDBM164210
Synonyms:
US9688615, 21
Type:
Small organic molecule
Emp. Form.:
C8H7Cl2N3
Mol. Mass.:
216.067
SMILES:
NCc1nc2cc(Cl)c(Cl)cc2[nH]1
: