Target
Glucagon-like peptide 1 receptor
Ligand
BDBM420050
Substrate
Meas. Tech.
GLP-1 Assay with GLP1 Endogenous Agonist
EC50
>30000±n/a nM
Citation
 Lindsley, CWNiswender, K Positive allosteric modulators of the GLP-1 receptor US Patent  US10487087 Publication Date 11/26/2019 
Target
Name:
Glucagon-like peptide 1 receptor
Synonyms:
GLP-1 receptor GLP-1R GLP1R_HUMAN Glucagon-like peptide 1 receptor (GLP-1)
Type:
Enzyme
Mol. Mass.:
53035.78
Organism:
Homo sapiens (Human)
Description:
P43220
Residue:
463
  
Inhibitor
Name:
BDBM420050
Synonyms:
(R)-N-((1-isopropylpyrrolidin-2-yl)methyl)-10- methyl-1-oxo-2-phenyl-1,2-dihydropyrazino[1,2- a]indole-4-carboxamide | US10487087, Compound 15
Type:
Small organic molecule
Emp. Form.:
C27H30N4O2
Mol. Mass.:
442.5527
SMILES:
CC(C)N1CCC[C@@H]1CNC(=O)c1cn(-c2ccccc2)c(=O)c2c(C)c3ccccc3n12
: