Target
Toll-like receptor 7
Ligand
BDBM273388
Substrate
Meas. Tech.
Biological Assay
IC50
1.30±n/a nM
Citation
 Dyckman, AJDodd, DSMussari, CPPasunoori, LKumar, SR [1,2,4]triazolo[1,5-a]pyridinyl substituted indole compounds US Patent  US10478424 Publication Date 11/19/2019 
Target
Name:
Toll-like receptor 7
Synonyms:
ORF Names:UNQ248/PRO285 TLR7_HUMAN | Toll-like receptor 7 (TLR7)
Type:
Enzyme
Mol. Mass.:
120945.35
Organism:
Homo sapiens (Human)
Description:
Q9NYK1
Residue:
1049
  
Inhibitor
Name:
BDBM273388
Synonyms:
US10071079, Example 171 | US10478424, Example 172
Type:
Small organic molecule
Emp. Form.:
C28H32N6
Mol. Mass.:
452.5939
SMILES:
CC(C)c1c([nH]c2ccc(cc12)C1CCN(CC2(CC2)C#N)CC1)-c1cc(C)c2ncnn2c1
: