Target
Isocitrate dehydrogenase [NADP] cytoplasmic [R132H]
Ligand
BDBM287809
Substrate
Meas. Tech.
R132H IDH1 Enzymatic Assay
IC50
1440±n/a nM
Citation
 Fischer, CBogen, SLChilders, MLFradera Llinas, FXEllis, JMEsposite, SHoffman, DMHuang, CKattar, SDKim, AJLampe, JWMachacek, MRMcMasters, DRParker, Jr., DLReutershan, MHSciammetta, NShao, PPSloman, DLSun, WUjjainwalla, FWu, ZYu, YGibeau, CR Tricyclic compounds as inhibitors of mutant IDH enzymes US Patent  US10508108 Publication Date 12/17/2019 
Target
Name:
Isocitrate dehydrogenase [NADP] cytoplasmic [R132H]
Synonyms:
Cytosolic NADP-isocitrate dehydrogenase (IDH1)(R132H) IDH1 R132H IDHC_HUMAN Isocitrate dehydrogenase 1 mutant (R132H) Isocitrate dehydrogenase [NADP] cytoplasmic (IDH1)(R132H) PICD
Type:
Protein
Mol. Mass.:
46641.74
Organism:
Homo sapiens (Human)
Description:
Human IDH1 R132H (SEQ ID No. 2 in patent). First three are removed. Google patent parsed wrong.
Residue:
414
  
Inhibitor
Name:
BDBM287809
Synonyms:
1-[4-(5,11-dihydro-6H- pyrido[2,3-b] [1,5]benzodiazepin-6- ylcarbonyl)bicyclo[2.2.2] oct-2-en-1-yl]ethanone US10508108, Example 27
Type:
Small organic molecule
Emp. Form.:
C23H23N3O2
Mol. Mass.:
373.4476
SMILES:
CC(=O)C12CCC(CC1)(C=C2)C(=O)N1Cc2cccnc2Nc2ccccc12
: