Target
Plasma kallikrein
Ligand
BDBM423187
Substrate
Meas. Tech.
Inhibition Assay
Ki
0.500±n/a nM
Citation
 Frattini, SLingard, IHamprecht, DWBakker, RAEckhardt, MGollner, AHehn, JPLangkopf, EWagner, HWellenzohn, BWiedenmayer, D Heteroarylcarboxamide derivatives as plasma kallikrein inhibitors US Patent  US10501440 Publication Date 12/10/2019 
Target
Name:
Plasma kallikrein
Synonyms:
Fletcher factor KLKB1 Kallikrein Plasma kallikrein heavy chain Plasma prekallikrein
Type:
Protein
Mol. Mass.:
71391.16
Organism:
Homo sapiens (Human)
Description:
P03952
Residue:
638
  
Inhibitor
Name:
BDBM423187
Synonyms:
N-[(5R)-1-Amino-3-methyl-5H,6H,7H-cyclopenta[c]pyridin-5-yl]-1-[(2-{3-azabicyclo[3.1.0]hexan-3-yl}-4-methylpyrimidin-5-yl)methyl]-1H-pyrazole-4-carboxamide | US10501440, Example 17
Type:
Small organic molecule
Emp. Form.:
C24H28N8O
Mol. Mass.:
444.5321
SMILES:
Cc1cc2[C@@H](CCc2c(N)n1)NC(=O)c1cnn(Cc2cnc(nc2C)N2CC3CC3C2)c1
: