Target
Lysine-specific histone demethylase 1A
Ligand
BDBM111190
Substrate
Meas. Tech.
LSD1 Histone Demethylase Biochemical Assay
pH
7.5±n/a
IC50
<50±n/a nM
Comments
extracted
Citation
 Wu, LCourter, JRHe, CLi, JLu, LSun, YWang, XYao, WZhang, CZhuo, J Substituted imidazo[1,2-a]pyrazines as LSD1 inhibitors US Patent  US10112950 Publication Date 10/30/2018 
Target
Name:
Lysine-specific histone demethylase 1A
Synonyms:
AOF2 Flavin-containing amine oxidase domain-containing protein 2 KDM1A KIAA0601 Lysine-specific demethylase 1 (LSD1) Lysine-specific histone demethylase 1 (LSD1)
Type:
Enzyme
Mol. Mass.:
92901.01
Organism:
Homo sapiens (Human)
Description:
O60341
Residue:
852
  
Inhibitor
Name:
BDBM111190
Synonyms:
US10112950, Example 42 US9695180, 42
Type:
Small organic molecule
Emp. Form.:
C28H30N6O
Mol. Mass.:
466.5774
SMILES:
CN(C)Cc1cn2c(-c3ccc(C)cc3)c(nc(OC[C@@H]3CCNC3)c2n1)-c1ccc(cc1)C#N
: