Target
Ectonucleotide pyrophosphatase/phosphodiesterase family member 2
Ligand
BDBM192950
Substrate
IC50
50±n/a nM
Citation
 Desroy, NHeckmann, BBrys, RCJoncour, AMPeixoto, CBock, XM Compounds and pharmaceutical compositions thereof for the treatment of inflammatory disorders US Patent  US10526329 Publication Date 1/7/2020 
Target
Name:
Ectonucleotide pyrophosphatase/phosphodiesterase family member 2
Synonyms:
ATX Autotaxin (ATX) ENPP2 Ectonucleotide Pyrophosphatase/Phosphodiesterase 2 (ENPP2) Extracellular lysophospholipase D PDNP2
Type:
Enzyme
Mol. Mass.:
99007.13
Organism:
Homo sapiens (Human)
Description:
Q13822
Residue:
863
  
Inhibitor
Name:
BDBM192950
Synonyms:
US10526329, Compound 145 US9670204, 145 2-(4-(3-((5-cyano-4-(4-fluorophenyl)thiazol-2-yl)(methyl)amino)-2-ethylimidazo[1,2-a]pyridin-6-yl)piperidin-1-yl)-N,N-dimethylacetamide
Type:
Small organic molecule
Emp. Form.:
C29H32FN7OS
Mol. Mass.:
545.674
SMILES:
CCc1nc2ccc(cn2c1N(C)c1nc(c(s1)C#N)-c1ccc(F)cc1)C1CCN(CC(=O)N(C)C)CC1
: