Target
Sphingosine 1-phosphate receptor 3
Ligand
BDBM37115
Substrate
Meas. Tech.
S1P1 assay
EC50
661±n/a nM
Citation
 Roberts, ERosen, HBrown, SGuerrero, MAPeng, XPoddutoori, R Modulators of sphingosine phosphate receptors US Patent  US10544136 Publication Date 1/28/2020 
Target
Name:
Sphingosine 1-phosphate receptor 3
Synonyms:
C9orf108 EDG3 S1P receptor 3 S1P3 S1PR3_HUMAN Sphingosine 1-phosphate receptor 3 (S1P3) | Sphingosine 1-phosphate receptor Edg-3
Type:
G Protein-Coupled Receptor (GPCR)
Mol. Mass.:
42278.13
Organism:
Homo sapiens (Human)
Description:
Q99500
Residue:
378
  
Inhibitor
Name:
BDBM37115
Synonyms:
4-[5-(3,4-diethoxyphenyl)-1,2,4-oxadiazol-3-yl]pyridine 5-(3,4-diethoxyphenyl)-3-pyridin-4-yl-1,2,4-oxadiazole SMR000075132 cid_976135
Type:
Small organic molecule
Emp. Form.:
C17H17N3O3
Mol. Mass.:
311.3352
SMILES:
CCOc1ccc(cc1OCC)-c1nc(no1)-c1ccncc1
: