Target
Lysine-specific histone demethylase 1A
Ligand
BDBM283267
Substrate
Meas. Tech.
In Vitro Enzyme Inhibition Assay - LSD-1
IC50
<100±n/a nM
Citation
 Xu, JCho, RNguyen, A Treatment of relapsed and/or refractory solid tumors and non-Hodgkin's lymphomas US Patent  US10548896 Publication Date 2/4/2020 
Target
Name:
Lysine-specific histone demethylase 1A
Synonyms:
AOF2 Flavin-containing amine oxidase domain-containing protein 2 KDM1A KIAA0601 Lysine-specific demethylase 1 (LSD1) Lysine-specific histone demethylase 1 (LSD1)
Type:
Enzyme
Mol. Mass.:
92901.01
Organism:
Homo sapiens (Human)
Description:
O60341
Residue:
852
  
Inhibitor
Name:
BDBM283267
Synonyms:
5-[2-(4-amino-piperidin-1-yl)-4- (4-cyano-3-fluoro-phenyl)-1-methyl- 6-oxo-1,6-dihydro-pyrimidin-5-yl]- pyridine-2-carboxylic acid methylamide US10207999, Example 50 US10548896, Example 50 US10960005, Example 50 US9573930, Example 50 US9776974, Example 50
Type:
Small organic molecule
Emp. Form.:
C24H24FN7O2
Mol. Mass.:
461.4915
SMILES:
CNC(=O)c1ccc(cn1)-c1c(nc(N2CCC(N)CC2)n(C)c1=O)-c1ccc(C#N)c(F)c1
: