Target
A disintegrin and metalloproteinase with thrombospondin motifs 6
Ligand
BDBM429691
Substrate
Meas. Tech.
hADAMTS-6 Assay
IC50
12.5±n/a nM
Citation
 Labéguère, FGHeng, RDe Ceuninck, FAAlvey, LJAmantini, DBrebion, FLDeprez, PMGosmini, RLJary, HMPeixoto, CPop-Botez, IEVarin, ML 5-[3-[piperzin-1-yl]-3-oxo-propyl]-imidazolidine-2,4-dione derivatives as ADAMTS 4 and 5 inhibitors for treating E.G. osteoarthritis US Patent  US10550100 Publication Date 2/4/2020 
Target
Name:
A disintegrin and metalloproteinase with thrombospondin motifs 6
Synonyms:
ADAM-TS 6 ADAMTS-6 ATS6_HUMAN
Type:
Protein
Mol. Mass.:
125276.26
Organism:
Human
Description:
Q9UKP5
Residue:
1117
  
Inhibitor
Name:
BDBM429691
Synonyms:
5-(3-(4-(4- chlorophenyl) piperidin-1- yl)-2-methyl- 3-oxopropyl)- 5-methyl imidazolidine- 2,4-dione | US10550100, Compound 24
Type:
Small organic molecule
Emp. Form.:
C19H24ClN3O3
Mol. Mass.:
377.865
SMILES:
C[C@@H](C[C@@]1(C)NC(=O)NC1=O)C(=O)N1CCC(CC1)c1ccc(Cl)cc1
: