Target
A disintegrin and metalloproteinase with thrombospondin motifs 6
Ligand
BDBM429769
Substrate
Meas. Tech.
hADAMTS-6 Assay
IC50
12.5±n/a nM
Citation
 Labéguère, FGHeng, RDe Ceuninck, FAAlvey, LJAmantini, DBrebion, FLDeprez, PMGosmini, RLJary, HMPeixoto, CPop-Botez, IEVarin, ML 5-[3-[piperzin-1-yl]-3-oxo-propyl]-imidazolidine-2,4-dione derivatives as ADAMTS 4 and 5 inhibitors for treating E.G. osteoarthritis US Patent  US10550100 Publication Date 2/4/2020 
Target
Name:
A disintegrin and metalloproteinase with thrombospondin motifs 6
Synonyms:
ADAM-TS 6 ADAMTS-6 ATS6_HUMAN
Type:
Protein
Mol. Mass.:
125276.26
Organism:
Human
Description:
Q9UKP5
Residue:
1117
  
Inhibitor
Name:
BDBM429769
Synonyms:
(5R)-5-[3-[4- (4-chloro-2- methoxy-5- methyl- phenyl)-1- piperidyl]-3- oxo-propyl]-5- methyl- imidazolidine- 2,4-dione | US10550100, Compound 89
Type:
Small organic molecule
Emp. Form.:
C20H26ClN3O4
Mol. Mass.:
407.891
SMILES:
COc1cc(Cl)c(C)cc1C1CCN(CC1)C(=O)CC[C@@]1(C)NC(=O)NC1=O
: