Target
A disintegrin and metalloproteinase with thrombospondin motifs 6
Ligand
BDBM429783
Substrate
Meas. Tech.
hADAMTS-6 Assay
IC50
12.5±n/a nM
Citation
 Labéguère, FGHeng, RDe Ceuninck, FAAlvey, LJAmantini, DBrebion, FLDeprez, PMGosmini, RLJary, HMPeixoto, CPop-Botez, IEVarin, ML 5-[3-[piperzin-1-yl]-3-oxo-propyl]-imidazolidine-2,4-dione derivatives as ADAMTS 4 and 5 inhibitors for treating E.G. osteoarthritis US Patent  US10550100 Publication Date 2/4/2020 
Target
Name:
A disintegrin and metalloproteinase with thrombospondin motifs 6
Synonyms:
ADAM-TS 6 ADAMTS-6 ATS6_HUMAN
Type:
Protein
Mol. Mass.:
125276.26
Organism:
Human
Description:
Q9UKP5
Residue:
1117
  
Inhibitor
Name:
BDBM429783
Synonyms:
5-[3-[4-(5- chloro-4- fluoro-2- methoxy- phenyl)-1- piperidyl]-2- methyl-3-oxo- propyl]-5- (methoxymethyl) imidazolidine- 2,4-dione | US10550100, Compound 107
Type:
Small organic molecule
Emp. Form.:
C21H27ClFN3O5
Mol. Mass.:
455.908
SMILES:
COC[C@]1(C[C@H](C)C(=O)N2CCC(CC2)c2cc(Cl)c(F)cc2OC)NC(=O)NC1=O
: