Target
Dual specificity tyrosine-phosphorylation-regulated kinase 1A
Ligand
BDBM385240
Substrate
Meas. Tech.
Z-lyte Assay
EC50
0.900±n/a nM
Citation
 KC, SKMittapalli, GKHofilena, BJMarakovits, JTChiruta, CMak, CCCao, J Isoquinolin-3-YL carboxamides and preparation and use thereof US Patent  US10556885 Publication Date 2/11/2020 
Target
Name:
Dual specificity tyrosine-phosphorylation-regulated kinase 1A
Synonyms:
DYR1A_HUMAN DYRK1A Dual specificity YAK1-related kinase 1A (Dyrk1A) Dual-specificity tyrosine-phosphorylation regulated kinase 1A HP86 MNBH
Type:
Enzyme
Mol. Mass.:
85616.61
Organism:
Homo sapiens (Human)
Description:
Q13627
Residue:
763
  
Inhibitor
Name:
BDBM385240
Synonyms:
US10287267, Compound 707 US10556885, Compound 707 US11673881, Compound 707
Type:
Small organic molecule
Emp. Form.:
C21H24N4OS
Mol. Mass.:
380.506
SMILES:
CN(C)[C@H]1CC[C@@H](CC1)C(=O)Nc1cc2cc(ccc2cn1)-c1cncs1
: