Target
Protein arginine N-methyltransferase 5
Ligand
BDBM430630
Substrate
Meas. Tech.
PRMT5 Biomarker Assay
IC50
1.000±n/a nM
Citation
 Stupple, AEWalker, SRStupple, PA Tetrahydroisoquinolines as PRMT5 inhibitors US Patent  US10550096 Publication Date 2/4/2020 
Target
Name:
Protein arginine N-methyltransferase 5
Synonyms:
72 kDa ICln-binding protein HRMT1L5 IBP72 Jak-binding protein 1 PRMT5/MEP50 complex Protein arginine methyltransferase 5 (PRMT5) SKB1 homolog Shk1 kinase-binding protein 1 homolog
Type:
Enzyme
Mol. Mass.:
72679.99
Organism:
Homo sapiens (Human)
Description:
O14744
Residue:
637
  
Inhibitor
Name:
BDBM430630
Synonyms:
US10550096, Example 3
Type:
Small organic molecule
Emp. Form.:
C28H32N4O4
Mol. Mass.:
488.5781
SMILES:
CCc1nn(C[C@@H](O)[C@@H]2Cc3ccccc3CN2)c(=O)c2ccc(cc12)C(=O)N1C2CCC1COC2
: