Target
Non-receptor tyrosine-protein kinase TYK2
Ligand
BDBM431908
Substrate
Meas. Tech.
Biochemical JAK Kinase Assays
Ki
0.400±n/a nM
Citation
 Fatheree, PRBrandt, GESmith, CSullivan, SDVan Orden, LJKleinschek, MACrater, GD JAK inhibitors containing a 4-membered heterocyclic amide US Patent  US10550118 Publication Date 2/4/2020 
Target
Name:
Non-receptor tyrosine-protein kinase TYK2
Synonyms:
Non-receptor tyrosine-protein kinase TYK2 (TYK2) TYK2_HUMAN | Tyrosine-protein kinase TYK2
Type:
Protein
Mol. Mass.:
133666.03
Organism:
Homo sapiens (Human)
Description:
P29597
Residue:
1187
  
Inhibitor
Name:
BDBM431908
Synonyms:
US10550118, Example 8-15 | US10954237, Example 8-15
Type:
Small organic molecule
Emp. Form.:
C32H38FN7O2
Mol. Mass.:
571.6882
SMILES:
CCN1Cc2[nH]c(nc2C[C@@H]1C(=O)N1CC(C1)N1CCCCC1)-c1n[nH]c2cc(ccc12)-c1cc(F)c(O)cc1CC
: