Target
Tyrosine-protein kinase JAK1
Ligand
BDBM431913
Substrate
Meas. Tech.
Biochemical JAK Kinase Assays
Ki
0.050±n/a nM
Citation
 Fatheree, PRBrandt, GESmith, CSullivan, SDVan Orden, LJKleinschek, MACrater, GD JAK inhibitors containing a 4-membered heterocyclic amide US Patent  US10550118 Publication Date 2/4/2020 
Target
Name:
Tyrosine-protein kinase JAK1
Synonyms:
JAK-1 JAK1A JAK1_HUMAN Janus kinase 1 (JAK1) | Janus kinase 1 JAK1
Type:
Protein
Mol. Mass.:
133293.73
Organism:
Homo sapiens (Human)
Description:
P23458
Residue:
1154
  
Inhibitor
Name:
BDBM431913
Synonyms:
US10550118, Example 8-20 US11453668, Example 8-20
Type:
Small organic molecule
Emp. Form.:
C29H34FN7O2
Mol. Mass.:
531.6244
SMILES:
CCN1Cc2[nH]c(nc2C[C@@H]1C(=O)N1CC(C1)N(C)C)-c1n[nH]c2cc(ccc12)-c1cc(F)c(O)cc1CC
: