Target
Somatostatin receptor type 4
Ligand
BDBM275921
Substrate
Meas. Tech.
Camp Assay
EC50
10.9±n/a nM
Citation
 Mazzaferro, RFerrara, MGiovannini, RLingard, IRudolf, K Morpholine and 1,4-oxazepane amides as somatostatin receptor subtype 4 (SSTR4) agonists US Patent  US10577336 Publication Date 3/3/2020 
Target
Name:
Somatostatin receptor type 4
Synonyms:
SOMATOSTATIN SST4 SS4-R SSR4_HUMAN SSTR4 | Somatostatin receptor type 4 (SSTR4)
Type:
Enzyme
Mol. Mass.:
42015.38
Organism:
Homo sapiens (Human)
Description:
P31391
Residue:
388
  
Inhibitor
Name:
BDBM275921
Synonyms:
US10071974, Example 32 | US10577336, Example 32
Type:
Small organic molecule
Emp. Form.:
C16H22N4O2
Mol. Mass.:
302.3715
SMILES:
Cc1cccc2c(cnn12)C(C)(C)NC(=O)[C@@H]1CNCCO1
: