Target
Interleukin-1 receptor-associated kinase 4
Ligand
BDBM374275
Substrate
Meas. Tech.
Biochemical Assay
IC50
<100.0±n/a nM
Citation
 Chan, TGuckian, KJenkins, TThomas, JVessels, JKumaravel, GMeissner, RLyssikatos, JLucas, BLeaf, IDuffield, J IRAK4 inhibiting agents US Patent  US10577367 Publication Date 3/3/2020 
Target
Name:
Interleukin-1 receptor-associated kinase 4
Synonyms:
IRAK-4 IRAK4_HUMAN Interleukin-1 receptor-associated kinase 4 (IRAK4) | Renal carcinoma antigen NY-REN-64
Type:
Protein
Mol. Mass.:
51519.08
Organism:
Homo sapiens (Human)
Description:
Q9NWZ3
Residue:
460
  
Inhibitor
Name:
BDBM374275
Synonyms:
(6-(6-(8-amino-8-propyl-5,6,7,8-tetrahydroquinolin-2-yl)-1H-indazol-1-yl)pyridin-2-yl)methanol US10577367, Example 421
Type:
Small organic molecule
Emp. Form.:
C25H27N5O
Mol. Mass.:
413.5148
SMILES:
CCCC1(N)CCCc2ccc(nc12)-c1ccc2cnn(-c3cccc(CO)n3)c2c1
: