Target
Dual specificity calcium/calmodulin-dependent 3',5'-cyclic nucleotide phosphodiesterase 1B
Ligand
BDBM433320
Substrate
Meas. Tech.
Enzyme Assay
IC50
3000±n/a nM
Citation
 Li, PZheng, HZhao, JWennogle, LP Organic compounds US Patent  US10561656 Publication Date 2/18/2020 
Target
Name:
Dual specificity calcium/calmodulin-dependent 3',5'-cyclic nucleotide phosphodiesterase 1B
Synonyms:
63 kDa Cam-PDE Calcium/calmodulin-dependent 3',5'-cyclic nucleotide phosphodiesterase 1B PDE1B PDE1B_HUMAN Phosphodiesterase 1B Phosphodiesterase Type 1 (PDE1B) | Phosphodiesterase, PDE1/PDE5
Type:
Enzyme
Mol. Mass.:
61366.51
Organism:
Homo sapiens (Human)
Description:
Residue:
536
  
Inhibitor
Name:
BDBM433320
Synonyms:
2-(4-(6-fluoropyridin-2-yl(benzyl)-3-(isopropylthio)-5,7,7-trimethyl-7,8-dihydro-2H-imidazo[1,2-a]pyrazolo[4,3-e]pyrimidin-4(5H)-one | US10561656, Example 3
Type:
Small organic molecule
Emp. Form.:
C25H27FN6OS
Mol. Mass.:
478.585
SMILES:
CC(C)Sc1c2c(nn1Cc1ccc(cc1)-c1cccc(F)n1)N1CC(C)(C)N=C1N(C)C2=O
: