Target
Vascular endothelial growth factor A
Ligand
BDBM102336
Substrate
Meas. Tech.
ELISA Assay
IC50
27400±n/a nM
Citation
 Gardner, JHShalwitz, RWu, S Prolyl hydroxylase inhibitors US Patent  US10562854 Publication Date 2/18/2020 
Target
Name:
Vascular endothelial growth factor A
Synonyms:
VEGF VEGFA VPF Vascular endothelial growth factor A (VEGF) Vascular permeability factor
Type:
Protein
Mol. Mass.:
27063.81
Organism:
Homo sapiens (Human)
Description:
P15692
Residue:
395
  
Inhibitor
Name:
BDBM102336
Synonyms:
US10562854, No. C17 US9278930, C17
Type:
Small organic molecule
Emp. Form.:
C20H26N2O2
Mol. Mass.:
326.4326
SMILES:
CC1CCC(CC1)NCc1ccn(Cc2ccccc2)c(=O)c1O
: