Target
Vascular endothelial growth factor A
Ligand
BDBM102337
Substrate
Meas. Tech.
ELISA Assay
IC50
42500±n/a nM
Citation
 Gardner, JHShalwitz, RWu, S Prolyl hydroxylase inhibitors US Patent  US10562854 Publication Date 2/18/2020 
Target
Name:
Vascular endothelial growth factor A
Synonyms:
VEGF VEGFA VPF Vascular endothelial growth factor A (VEGF) Vascular permeability factor
Type:
Protein
Mol. Mass.:
27063.81
Organism:
Homo sapiens (Human)
Description:
P15692
Residue:
395
  
Inhibitor
Name:
BDBM102337
Synonyms:
US10562854, No. C35 US9278930, C35
Type:
Small organic molecule
Emp. Form.:
C19H22N4O2
Mol. Mass.:
338.4036
SMILES:
Oc1c(CNCCCn2ccnc2)ccn(Cc2ccccc2)c1=O
: