Target
Vascular endothelial growth factor A
Ligand
BDBM102340
Substrate
Meas. Tech.
ELISA Assay
IC50
53000±n/a nM
Citation
 Gardner, JHShalwitz, RWu, S Prolyl hydroxylase inhibitors US Patent  US10562854 Publication Date 2/18/2020 
Target
Name:
Vascular endothelial growth factor A
Synonyms:
VEGF VEGFA VPF Vascular endothelial growth factor A (VEGF) Vascular permeability factor
Type:
Protein
Mol. Mass.:
27063.81
Organism:
Homo sapiens (Human)
Description:
P15692
Residue:
395
  
Inhibitor
Name:
BDBM102340
Synonyms:
US10562854, No. C33 US9278930, C33
Type:
Small organic molecule
Emp. Form.:
C16H20N2O2S
Mol. Mass.:
304.407
SMILES:
CSCCNCc1ccn(Cc2ccccc2)c(=O)c1O
: