Target
Egl nine homolog 1
Ligand
BDBM102341
Substrate
Meas. Tech.
Activity Assay
IC50
11000±n/a nM
Citation
 Gardner, JHShalwitz, RWu, S Prolyl hydroxylase inhibitors US Patent  US10562854 Publication Date 2/18/2020 
Target
Name:
Egl nine homolog 1
Synonyms:
C1orf12 EGLN1_HUMAN Hypoxia-inducible factor prolyl hydroxylase 2 (HIF-PH2) Prolyl hydroxylase domain-containing protein 2 (PHD2)
Type:
Protein
Mol. Mass.:
46035.59
Organism:
Homo sapiens (Human)
Description:
Q9GZT9
Residue:
426
  
Inhibitor
Name:
BDBM102341
Synonyms:
US10562854, No. B14 US9278930, B14
Type:
Small organic molecule
Emp. Form.:
C21H22ClN5O2
Mol. Mass.:
411.885
SMILES:
Oc1c(CN2CCN(CC2)c2ccc(Cl)nn2)ccn(Cc2ccccc2)c1=O
: