Target
Vascular endothelial growth factor A
Ligand
BDBM102342
Substrate
Meas. Tech.
ELISA Assay
IC50
62900±n/a nM
Citation
 Gardner, JHShalwitz, RWu, S Prolyl hydroxylase inhibitors US Patent  US10562854 Publication Date 2/18/2020 
Target
Name:
Vascular endothelial growth factor A
Synonyms:
VEGF VEGFA VPF Vascular endothelial growth factor A (VEGF) Vascular permeability factor
Type:
Protein
Mol. Mass.:
27063.81
Organism:
Homo sapiens (Human)
Description:
P15692
Residue:
395
  
Inhibitor
Name:
BDBM102342
Synonyms:
US10562854, No. C19 US9278930, C19
Type:
Small organic molecule
Emp. Form.:
C19H23N3O3
Mol. Mass.:
341.4042
SMILES:
Oc1c(CNC2CCCCNC2=O)ccn(Cc2ccccc2)c1=O
: