Target
Vascular endothelial growth factor A
Ligand
BDBM102345
Substrate
Meas. Tech.
ELISA Assay
IC50
27000±n/a nM
Citation
 Gardner, JHShalwitz, RWu, S Prolyl hydroxylase inhibitors US Patent  US10562854 Publication Date 2/18/2020 
Target
Name:
Vascular endothelial growth factor A
Synonyms:
VEGF VEGFA VPF Vascular endothelial growth factor A (VEGF) Vascular permeability factor
Type:
Protein
Mol. Mass.:
27063.81
Organism:
Homo sapiens (Human)
Description:
P15692
Residue:
395
  
Inhibitor
Name:
BDBM102345
Synonyms:
US10562854, No. D10 US9278930, D10
Type:
Small organic molecule
Emp. Form.:
C23H31N3O4S
Mol. Mass.:
445.575
SMILES:
Cc1ccc(cc1)S(=O)(=O)n1ccc(CN2CCC(CC2)N2CCCCC2)c(O)c1=O
: