Target
Egl nine homolog 1
Ligand
BDBM102346
Substrate
Meas. Tech.
Activity Assay
IC50
12000±n/a nM
Citation
 Gardner, JHShalwitz, RWu, S Prolyl hydroxylase inhibitors US Patent  US10562854 Publication Date 2/18/2020 
Target
Name:
Egl nine homolog 1
Synonyms:
C1orf12 EGLN1_HUMAN Hypoxia-inducible factor prolyl hydroxylase 2 (HIF-PH2) Prolyl hydroxylase domain-containing protein 2 (PHD2)
Type:
Protein
Mol. Mass.:
46035.59
Organism:
Homo sapiens (Human)
Description:
Q9GZT9
Residue:
426
  
Inhibitor
Name:
BDBM102346
Synonyms:
US10562854, No. D14 US9278930, D14
Type:
Small organic molecule
Emp. Form.:
C21H22ClN5O4S
Mol. Mass.:
475.948
SMILES:
Cc1ccc(cc1)S(=O)(=O)n1ccc(CN2CCN(CC2)c2ccc(Cl)nn2)c(O)c1=O
: