Target
Egl nine homolog 1
Ligand
BDBM102351
Substrate
Meas. Tech.
Activity Assay
IC50
5000±n/a nM
Citation
 Gardner, JHShalwitz, RWu, S Prolyl hydroxylase inhibitors US Patent  US10562854 Publication Date 2/18/2020 
Target
Name:
Egl nine homolog 1
Synonyms:
C1orf12 EGLN1_HUMAN Hypoxia-inducible factor prolyl hydroxylase 2 (HIF-PH2) Prolyl hydroxylase domain-containing protein 2 (PHD2)
Type:
Protein
Mol. Mass.:
46035.59
Organism:
Homo sapiens (Human)
Description:
Q9GZT9
Residue:
426
  
Inhibitor
Name:
BDBM102351
Synonyms:
US10562854, No. F2 US9278930, F2
Type:
Small organic molecule
Emp. Form.:
C12H10ClNO2
Mol. Mass.:
235.666
SMILES:
Oc1cccn(Cc2cccc(Cl)c2)c1=O
: