Target
Interleukin-1 receptor-associated kinase 4
Ligand
BDBM434723
Substrate
Meas. Tech.
Kinase Activity Inhibition Assay
IC50
550±n/a nM
Citation
 Xu, JCai, QCha, MYKim, M IRAK4 inhibitor and use thereof US Patent  US10562902 Publication Date 2/18/2020 
Target
Name:
Interleukin-1 receptor-associated kinase 4
Synonyms:
IRAK-4 IRAK4_HUMAN Interleukin-1 receptor-associated kinase 4 (IRAK4) | Renal carcinoma antigen NY-REN-64
Type:
Protein
Mol. Mass.:
51519.08
Organism:
Homo sapiens (Human)
Description:
Q9NWZ3
Residue:
460
  
Inhibitor
Name:
BDBM434723
Synonyms:
US10562902, Compound 129
Type:
Small organic molecule
Emp. Form.:
C22H25N7O2S
Mol. Mass.:
451.545
SMILES:
CNC(=O)c1csc(Nc2nc(OC3CCCCC3)c3n(ccc3n2)-c2cnn(C)c2)c1
: