Target
cAMP and cAMP-inhibited cGMP 3',5'-cyclic phosphodiesterase 10A
Ligand
BDBM362483
Substrate
Meas. Tech.
In Vitro Pharmacology Assay
IC50
<500±n/a nM
Citation
 Campbell, JEHewitt, MCJones, PXXie, L Substituted quinoxalines as PDE-10 inhibitors US Patent  US10562916 Publication Date 2/18/2020 
Target
Name:
cAMP and cAMP-inhibited cGMP 3',5'-cyclic phosphodiesterase 10A
Synonyms:
3',5'-cyclic phosphodiesterase PDE10A Phosphodiesterase 10 (PDE10) | Phosphodiesterase 10A
Type:
Protein
Mol. Mass.:
88412.52
Organism:
Homo sapiens (Human)
Description:
Q9Y233
Residue:
1055
  
Inhibitor
Name:
BDBM362483
Synonyms:
US10562916, Compound 43 | US9834564, Compound 43
Type:
Small organic molecule
Emp. Form.:
C21H18FN3
Mol. Mass.:
331.3861
SMILES:
Cn1cc(nc1CCc1ccc2ccccc2n1)-c1cccc(F)c1
: