Target
Chloroquine resistance transporter
Ligand
BDBM434960
Substrate
Meas. Tech.
Efficacy of ELQ-337 In Vitro
IC50
2.50±n/a nM
Citation
 Riscoe, MNilsen, AMiley, GWinter, RPou, SKelly, JXDodean, R Quinolone-3-diarylethers US Patent  US10584098 Publication Date 3/10/2020  Article 
Target
Name:
Chloroquine resistance transporter
Synonyms:
CRT PfCRT
Type:
PROTEIN
Mol. Mass.:
48687.29
Organism:
Plasmodium falciparum
Description:
ChEMBL_1364181
Residue:
424
  
Inhibitor
Name:
BDBM434960
Synonyms:
US10584098, Code ELQ-359
Type:
Small organic molecule
Emp. Form.:
C28H21ClF3NO6
Mol. Mass.:
559.918
SMILES:
Cc1nc2cc(CO)c(Cl)cc2c(OC(=O)OCC=C)c1-c1ccc(Oc2ccc(OC(F)(F)F)cc2)cc1
: