Target
Neurotensin receptor type 1
Ligand
BDBM297657
Substrate
Meas. Tech.
NTR1 Ca2+ Flux Dose Response
EC50
>10000±n/a nM
Citation
 Pinkerton, ABHershberger, PMPeddibhotla, SMaloney, PRHedrick, MP Small molecule agonists of neurotensin receptor 1 US Patent  US10584103 Publication Date 3/10/2020 
Target
Name:
Neurotensin receptor type 1
Synonyms:
Dopamine receptor D2L/neurotensin receptor NTS1 NTRR Neurotensin receptor 1 | neurotensin receptor type 1
Type:
PROTEIN
Mol. Mass.:
46278.89
Organism:
Homo sapiens (Human)
Description:
ChEMBL_1453811
Residue:
418
  
Inhibitor
Name:
BDBM297657
Synonyms:
2-{2-cyclopropyl-4-[4-(2- methoxy-phenyl)-piperidin- 1-yl]-6-methyl-pyrimidin-5- yl}-N-(2-hydroxy-ethyl)-N- methyl-acetamide US10584103, Example 159
Type:
Small organic molecule
Emp. Form.:
C25H34N4O3
Mol. Mass.:
438.5625
SMILES:
COc1ccccc1C1CCN(CC1)c1nc(nc(C)c1CC(=O)N(C)CCO)C1CC1
: