Target
Glutaminyl-peptide cyclotransferase
Ligand
BDBM435082
Substrate
Meas. Tech.
QC Inhibition Assay
Ki
124±n/a nM
Citation
 Chen, CShih, CChen, CWang, HHuang, K Benzimidazole compounds and use thereof for treating Alzheimer's Disease or Huntington's Disease US Patent  US10584120 Publication Date 3/10/2020 
Target
Name:
Glutaminyl-peptide cyclotransferase
Synonyms:
Glutaminyl Cyclase Glutaminyl-peptide cyclotransferase Glutaminyl-tRNA cyclotransferase QPCT | QPCT_HUMAN
Type:
Enzyme
Mol. Mass.:
40877.05
Organism:
Homo sapiens (Human)
Description:
Q16769
Residue:
361
  
Inhibitor
Name:
BDBM435082
Synonyms:
US10584120, Compound 13
Type:
Small organic molecule
Emp. Form.:
C21H15F3N4OS
Mol. Mass.:
428.43
SMILES:
FC(F)(F)c1ccc(s1)-c1ccc(cc1)C1CNC(=O)N1c1ccc2[nH]cnc2c1
: