Target
Glutaminyl-peptide cyclotransferase
Ligand
BDBM435093
Substrate
Meas. Tech.
QC Inhibition Assay
Ki
101±n/a nM
Citation
 Chen, CShih, CChen, CWang, HHuang, K Benzimidazole compounds and use thereof for treating Alzheimer's Disease or Huntington's Disease US Patent  US10584120 Publication Date 3/10/2020 
Target
Name:
Glutaminyl-peptide cyclotransferase
Synonyms:
Glutaminyl Cyclase Glutaminyl-peptide cyclotransferase Glutaminyl-tRNA cyclotransferase QPCT | QPCT_HUMAN
Type:
Enzyme
Mol. Mass.:
40877.05
Organism:
Homo sapiens (Human)
Description:
Q16769
Residue:
361
  
Inhibitor
Name:
BDBM435093
Synonyms:
US10584120, Compound 24
Type:
Small organic molecule
Emp. Form.:
C21H13F5N4OS
Mol. Mass.:
464.411
SMILES:
Fc1cc(cc(F)c1C1CNC(=O)N1c1ccc2[nH]cnc2c1)-c1ccc(s1)C(F)(F)F
: