Target
Glutaminyl-peptide cyclotransferase
Ligand
BDBM435094
Substrate
Meas. Tech.
QC Inhibition Assay
Ki
71.0±n/a nM
Citation
 Chen, CShih, CChen, CWang, HHuang, K Benzimidazole compounds and use thereof for treating Alzheimer's Disease or Huntington's Disease US Patent  US10584120 Publication Date 3/10/2020 
Target
Name:
Glutaminyl-peptide cyclotransferase
Synonyms:
Glutaminyl Cyclase Glutaminyl-peptide cyclotransferase Glutaminyl-tRNA cyclotransferase QPCT | QPCT_HUMAN
Type:
Enzyme
Mol. Mass.:
40877.05
Organism:
Homo sapiens (Human)
Description:
Q16769
Residue:
361
  
Inhibitor
Name:
BDBM435094
Synonyms:
US10584120, Compound 25
Type:
Small organic molecule
Emp. Form.:
C21H14F4N4OS
Mol. Mass.:
446.421
SMILES:
Fc1cc(ccc1-c1csc(c1)C(F)(F)F)C1CNC(=O)N1c1ccc2[nH]cnc2c1
: