Target
Glutaminyl-peptide cyclotransferase
Ligand
BDBM435112
Substrate
Meas. Tech.
QC Inhibition Assay
Ki
8.00±n/a nM
Citation
 Chen, CShih, CChen, CWang, HHuang, K Benzimidazole compounds and use thereof for treating Alzheimer's Disease or Huntington's Disease US Patent  US10584120 Publication Date 3/10/2020 
Target
Name:
Glutaminyl-peptide cyclotransferase
Synonyms:
Glutaminyl Cyclase Glutaminyl-peptide cyclotransferase Glutaminyl-tRNA cyclotransferase QPCT | QPCT_HUMAN
Type:
Enzyme
Mol. Mass.:
40877.05
Organism:
Homo sapiens (Human)
Description:
Q16769
Residue:
361
  
Inhibitor
Name:
BDBM435112
Synonyms:
US10584120, Compound 46
Type:
Small organic molecule
Emp. Form.:
C19H13F3N8O2
Mol. Mass.:
442.3541
SMILES:
FC(F)(F)Cn1nnc(n1)-c1ccc(cc1)C1N(C(=O)NC1=O)c1ccc2[nH]cnc2c1
: