Target
Glutaminyl-peptide cyclotransferase
Ligand
BDBM435125
Substrate
Meas. Tech.
QC Inhibition Assay
Ki
19.0±n/a nM
Citation
 Chen, CShih, CChen, CWang, HHuang, K Benzimidazole compounds and use thereof for treating Alzheimer's Disease or Huntington's Disease US Patent  US10584120 Publication Date 3/10/2020 
Target
Name:
Glutaminyl-peptide cyclotransferase
Synonyms:
Glutaminyl Cyclase Glutaminyl-peptide cyclotransferase Glutaminyl-tRNA cyclotransferase QPCT | QPCT_HUMAN
Type:
Enzyme
Mol. Mass.:
40877.05
Organism:
Homo sapiens (Human)
Description:
Q16769
Residue:
361
  
Inhibitor
Name:
BDBM435125
Synonyms:
US10584120, Compound 59
Type:
Small organic molecule
Emp. Form.:
C20H13ClF2N4OS
Mol. Mass.:
430.858
SMILES:
Fc1c(F)c(ccc1C1CNC(=O)N1c1ccc2[nH]cnc2c1)-c1csc(Cl)c1
: