Target
Diacylglycerol O-acyltransferase 2
Ligand
BDBM435236
Substrate
Meas. Tech.
Enzymatic Activity Assay
IC50
3.60±n/a nM
Citation
 Imbriglio, JLiang, RLondon, CMarby, KTata, JYou, MXiong, Y Tetrahydroisoquinoline derivatives useful as inhibitors of diacylglyceride O-acyltransferase 2 US Patent  US10568876 Publication Date 2/25/2020 
Target
Name:
Diacylglycerol O-acyltransferase 2
Synonyms:
ARAT DGAT2 Diacylglycerol O-acyltransferase 2 (DGAT2) Retinol O-fatty-acyltransferase
Type:
Multi-pass membrane protein
Mol. Mass.:
43848.90
Organism:
Homo sapiens (Human)
Description:
Q96PD7
Residue:
388
  
Inhibitor
Name:
BDBM435236
Synonyms:
US10568876, Example 1
Type:
Small organic molecule
Emp. Form.:
C29H32F3N5O4
Mol. Mass.:
571.5907
SMILES:
Cc1noc(n1)C1CC1C(=O)NCc1ccc(-c2cccc(OC(F)(F)F)c2)c2CCN(Cc12)C(=O)NC(C)(C)C
: