Target
Diacylglycerol O-acyltransferase 2
Ligand
BDBM435245
Substrate
Meas. Tech.
Enzymatic Activity Assay
IC50
166±n/a nM
Citation
 Imbriglio, JLiang, RLondon, CMarby, KTata, JYou, MXiong, Y Tetrahydroisoquinoline derivatives useful as inhibitors of diacylglyceride O-acyltransferase 2 US Patent  US10568876 Publication Date 2/25/2020 
Target
Name:
Diacylglycerol O-acyltransferase 2
Synonyms:
ARAT DGAT2 Diacylglycerol O-acyltransferase 2 (DGAT2) Retinol O-fatty-acyltransferase
Type:
Multi-pass membrane protein
Mol. Mass.:
43848.90
Organism:
Homo sapiens (Human)
Description:
Q96PD7
Residue:
388
  
Inhibitor
Name:
BDBM435245
Synonyms:
N-(tert-butyl)-5-(5-(2-hydroxypropan- 2-yl)pyridin-3-yl)-8-(((trans)-2- phenylcyclopropanecarboxamido) methyl)-3,4-dihydroisoquinoline-2(1H)- carboxamide (mixture of 2 isomers) | US10568876, Example 10
Type:
Small organic molecule
Emp. Form.:
C33H40N4O3
Mol. Mass.:
540.6957
SMILES:
CC(C)(C)NC(=O)N1CCc2c(C1)c(CNC(=O)C1C[C@H]1c1ccccc1)ccc2-c1cncc(c1)C(C)(C)O
: