Target
Diacylglycerol O-acyltransferase 2
Ligand
BDBM435261
Substrate
Meas. Tech.
Enzymatic Activity Assay
IC50
144±n/a nM
Citation
 Imbriglio, JLiang, RLondon, CMarby, KTata, JYou, MXiong, Y Tetrahydroisoquinoline derivatives useful as inhibitors of diacylglyceride O-acyltransferase 2 US Patent  US10568876 Publication Date 2/25/2020 
Target
Name:
Diacylglycerol O-acyltransferase 2
Synonyms:
ARAT DGAT2 Diacylglycerol O-acyltransferase 2 (DGAT2) Retinol O-fatty-acyltransferase
Type:
Multi-pass membrane protein
Mol. Mass.:
43848.90
Organism:
Homo sapiens (Human)
Description:
Q96PD7
Residue:
388
  
Inhibitor
Name:
BDBM435261
Synonyms:
N-(isoxazol-3-yl)-5-(3- methoxyphenyl)-8-(((trans)-2-(3- methyl-1,2,4-oxadiazol-5- yl)cyclopropanecarboxamido)methyl)- 3,4-dihydroisoquinoline-2(1H)- carboxamide (mixture of 2 isomers) | US10568876, Example 25
Type:
Small organic molecule
Emp. Form.:
C28H28N6O5
Mol. Mass.:
528.5591
SMILES:
COc1cccc(c1)-c1ccc(CNC(=O)[C@@H]2C[C@H]2c2nc(C)no2)c2CN(CCc12)C(=O)Nc1ccon1
: