Target
Diacylglycerol O-acyltransferase 2
Ligand
BDBM435283
Substrate
Meas. Tech.
Enzymatic Activity Assay
IC50
0.660±n/a nM
Citation
 Imbriglio, JLiang, RLondon, CMarby, KTata, JYou, MXiong, Y Tetrahydroisoquinoline derivatives useful as inhibitors of diacylglyceride O-acyltransferase 2 US Patent  US10568876 Publication Date 2/25/2020 
Target
Name:
Diacylglycerol O-acyltransferase 2
Synonyms:
ARAT DGAT2 Diacylglycerol O-acyltransferase 2 (DGAT2) Retinol O-fatty-acyltransferase
Type:
Multi-pass membrane protein
Mol. Mass.:
43848.90
Organism:
Homo sapiens (Human)
Description:
Q96PD7
Residue:
388
  
Inhibitor
Name:
BDBM435283
Synonyms:
US10568876, Example 46 | ethyl 5-(2-(tert-butylcarbamoyl)-8- (((trans)-2- phenylcyclopropanecarboxamido) methyl)-1,2,3,4-tetrahydroisoquinolin-5- yl)nicotinate (mixture of 2 isomers)
Type:
Small organic molecule
Emp. Form.:
C33H38N4O4
Mol. Mass.:
554.6792
SMILES:
CCOC(=O)c1cncc(c1)-c1ccc(CNC(=O)C2C[C@H]2c2ccccc2)c2CN(CCc12)C(=O)NC(C)(C)C
: