Target
Diacylglycerol O-acyltransferase 2
Ligand
BDBM435284
Substrate
Meas. Tech.
Enzymatic Activity Assay
IC50
173±n/a nM
Citation
 Imbriglio, JLiang, RLondon, CMarby, KTata, JYou, MXiong, Y Tetrahydroisoquinoline derivatives useful as inhibitors of diacylglyceride O-acyltransferase 2 US Patent  US10568876 Publication Date 2/25/2020 
Target
Name:
Diacylglycerol O-acyltransferase 2
Synonyms:
ARAT DGAT2 Diacylglycerol O-acyltransferase 2 (DGAT2) Retinol O-fatty-acyltransferase
Type:
Multi-pass membrane protein
Mol. Mass.:
43848.90
Organism:
Homo sapiens (Human)
Description:
Q96PD7
Residue:
388
  
Inhibitor
Name:
BDBM435284
Synonyms:
N-(tert-butyl)-8-(((trans)-2- phenylcyclopropanecarboxamido) methyl)-5-(5-(trifluoromethyl) pyridin-3-yl)-3,4- dihydroisoquinoline-2(1H)- carboxamide (mixture of 2 isomers) | US10568876, Example 47
Type:
Small organic molecule
Emp. Form.:
C31H33F3N4O2
Mol. Mass.:
550.6145
SMILES:
CC(C)(C)NC(=O)N1CCc2c(C1)c(CNC(=O)C1C[C@H]1c1ccccc1)ccc2-c1cncc(c1)C(F)(F)F
: